{"text_format":"1","workbook":"xlsx","n_sheets":8,"sheets":["Model 1A","Model 1B","Model 1C","rate","Model 1D","Model 2B","Model 2B (USD)","hidden"],"not_rendered":{"charts":0,"images":0,"macros":0,"external_links":1,"defined_names":32,"comments":3,"pivot_tables":0},"unopened":[],"bounds":{"document_bytes":16777216,"sheet_cells":100000,"rows_first":2000,"rows_last":500,"rows_between":2000,"halvings":0,"cell_chars":16384,"cell_head_chars":4096},"cells_cut":0,"cells_raw":0,"read":"whole","date_system":"1900"}

{"sheet":"Model 1A","index":0,"n_rows":24,"n_cols":11,"rows_kept":24,"cut":false,"hidden":false,"merged":[[10,1,10,4],[10,9,10,10],[7,5,7,10],[8,5,8,10],[7,1,7,4],[8,1,8,4],[15,1,15,3],[15,4,15,6],[9,1,9,4],[9,6,9,8],[9,9,9,10]]}
[]
[]
[]
[]
["Model 1A",null,"OWN INITIATIVES - TEAM"]
[null,null,"Overview of the income",null,null,null,null,null,null,null,"€"]
[]
[null,"FLEMISH UNIVERSITY:"]
[null,"PARTNER INSTITUTION :"]
[null,"PROJECT YEAR : ",null,null,null,null,"VLIR-UOS PROJECTCODE :"]
[null,"PERIOD :",null,null,null,"from :",null,"to :"]
[]
[]
[]
[]
[null,"DGD/VLIR-UOS allowance :"]
[]
[]
[null,null,"Duly certified,"]
[]
[]
[]
[]
[null,null,"Name and duty of the undersigned"]

{"sheet":"Model 1B","index":1,"n_rows":38,"n_cols":15,"rows_kept":38,"cut":false,"hidden":false,"merged":[[7,1,7,4],[7,10,7,11],[4,5,4,11],[5,5,5,11],[6,7,6,9],[6,10,6,11],[4,1,4,4],[5,1,5,4],[6,1,6,4]]}
[]
["Model 1B","OWN INITIATIVES - TEAM"]
[null,"Financial report in EURO",null,null,null,null,null,null,null,null,null,null,null,null,"€"]
[]
[null,"FLEMISH UNIVERSITY:",null,null,null,{"$f":"+'Model 1A'!F8","v":0}]
[null,"PARTNER INSTITUTION :",null,null,null,{"$f":"+'Model 1A'!F9","v":0}]
[null,"PROJECT YEAR : ",null,null,null,{"$f":"+apYear","v":0},null,"VLIR-UOS PROJECTCODE :",null,null,{"$f":"+'Model 1A'!J10","v":0}]
[null,"PERIOD :",null,null,null,"from :",null,{"$f":"'Model 1A'!G11","v":"00:00:00"},"to :",{"$f":"'Model 1A'!I11","v":"00:00:00"}]
[]
[]
[null,"BUDGETLINES",null,null,"APPROVED","Realigned",null,"Expenses in EURO",null,null,"Difference","References"]
[null,null,null,null,"Budget","Budget",null,"Belgian Acc.","Local Acc.","TOTAL 1C+1D+coord","(Budget) - "]
[null,null,null,null,null,null,null,null,null,null,"(Total 1C+1D+coord.)"]
[]
[null,null,null,null,null,null,null,"Model 1C","Model 1D","TOTAL 1C+1D"]
[null,"A. INVESTMENT COSTS",null,null,null,{"$f":"+E16","v":0},null,{"$f":"+'Model 1C'!J14","v":0},{"$f":"+'Model 1D'!L14","v":0},{"$f":"+SUM(H16:I16)","v":0},{"$f":"+F16-J16","v":0}]
[null,"B. OPERATIONAL COSTS",null,null,null,{"$f":"+E17","v":0},null,{"$f":"+'Model 1C'!J15","v":0},{"$f":"+'Model 1D'!L15","v":0},{"$f":"+SUM(H17:I17)","v":0},{"$f":"+F17-J17","v":0}]
[null,"C. PERSONNEL COSTS",null,null,null,{"$f":"+E18","v":0},null,{"$f":"+'Model 1C'!J16","v":0},{"$f":"+'Model 1D'!L16","v":0},{"$f":"+SUM(H18:I18)","v":0},{"$f":"+F18-J18","v":0}]
[null,"D. SCHOLARSHIPS COSTS",null,null,null,{"$f":"+E19","v":0},null,{"$f":"+'Model 1C'!J17","v":0},{"$f":"+'Model 1D'!L17","v":0},{"$f":"+SUM(H19:I19)","v":0},{"$f":"+F19-J19","v":0}]
[]
[null,"SUBTOTAL A to D",null,null,{"$f":"+SUM(E14:E20)","v":0},{"$f":"+SUM(F14:F20)","v":0},null,{"$f":"+SUM(H14:H20)","v":0},{"$f":"+SUM(I14:I20)","v":0},{"$f":"+SUM(J14:J20)","v":0},{"$f":"+SUM(K14:K20)","v":0}]
[]
[]
[null,"E. COORDINATION COSTS (max 10% from A to D)"]
[null,"E.1. Coord.costs for the Flemish univ. ","(5% from A to D - lump sum on approved budget)",null,{"$f":"+E21*0.05","v":0},{"$f":"+E25","v":0},null,{"$f":"+E25","v":0},null,{"$f":"+SUM(H25:I25)","v":0},{"$f":"+F25-J25","v":0}]
[null,"E.2. Coord. Costs for the local univ.","(5% from A to D - lump sum on approved budget)",null,{"$f":"+E21*0.05","v":0},{"$f":"+E26","v":0},null,null,{"$f":"+E26","v":0},{"$f":"+SUM(H26:I26)","v":0},{"$f":"+F26-J26","v":0}]
[]
[null,"TOTAL E",null,null,{"$f":"+SUM(E24:E27)","v":0},{"$f":"+SUM(F24:F27)","v":0},null,{"$f":"+SUM(H24:H27)","v":0},{"$f":"+SUM(I24:I27)","v":0},{"$f":"+SUM(J24:J27)","v":0},{"$f":"+SUM(K24:K27)","v":0}]
[]
[]
[]
[]
[]
[null,"GRAND TOTAL (A to E)",null,null,{"$f":"+E21+E28","v":0},{"$f":"+F21+F28","v":0},null,{"$f":"+H21+H28","v":0},{"$f":"+I21+I28","v":0},{"$f":"+J21+J28","v":0},{"$f":"+K21+K28","v":0}]
[]
[null,null,null,null,"Duly certified,"]
[]
[null,null,null,null,"Name and function of the undersigned"]

{"sheet":"Model 1C","index":2,"n_rows":775,"n_cols":12,"rows_kept":775,"cut":false,"hidden":false,"merged":[[7,8,7,9],[4,3,4,9],[5,3,5,9],[6,5,6,7],[6,8,6,9],[4,0,4,2],[5,0,5,2],[6,0,6,2],[7,0,7,2]]}
[]
["Model 1C",null,"OWN INITIATIVES - TEAM"]
[null,null,"Overview of the expenses from the Belgian account ",null,null,null,null,null,null,null,null,"€"]
[]
["FLEMISH UNIVERSITY:",null,null,{"$f":"+'Model 1A'!F8","v":0}]
["PARTNER INSTITUTION :",null,null,{"$f":"+'Model 1A'!F9","v":0}]
["PROJECT YEAR : ",null,null,{"$f":"+apYear","v":0},null,"VLIR-UOS PROJECTCODE :",null,null,{"$f":"+'Model 1A'!J10","v":0}]
["PERIOD :",null,null,"from :",null,{"$f":"+begindatum","v":"00:00:00"},"to :",{"$f":"+einddatum","v":"00:00:00"}]
[]
[]
[null,null,null,null,null,null,null,null,null,"TOTALS"]
[]
[]
[null,"A. INVESTMENT COSTS",null,null,null,null,null,null,null,{"$f":"SUMIF($B$24:$B$773,$B14,J$24:J$773)","v":0}]
[null,"B. OPERATIONAL COSTS",null,null,null,null,null,null,null,{"$f":"SUMIF($B$24:$B$773,$B15,J$24:J$773)","v":0}]
[null,"C. PERSONNEL COSTS",null,null,null,null,null,null,null,{"$f":"SUMIF($B$24:$B$773,$B16,J$24:J$773)","v":0}]
[null,"D. SCHOLARSHIPS COSTS",null,null,null,null,null,null,null,{"$f":"SUMIF($B$24:$B$773,$B17,J$24:J$773)","v":0}]
[]
[]
[null,"Errors :",null,null,null,null,null,null,null,{"$f":"ROUND(J774-SUM(J12:J19),2)","v":0},{"$f":"IF(J20=0,\"\",\"error : no category ?\")","v":""}]
[null,null,null,null,null,null,null,null,null,{"$f":"+SUM(J12:J20)","v":0}]
[{"$f":"+A2","v":"Model 1C"}]
["N°","Category","Inv. Date","classif n°","supplier","description","Amount local","Local Currency","exchange EUR/LocCur","Amount EUR"]
[1,null,null,null,null,null,null,"EUR",{"$f":"IF(H24=\"eur\",1,\"\")","v":1},{"$f":"+G24*I24","v":0}]
[2,null,null,null,null,null,null,"EUR",{"$f":"IF(H25=\"eur\",1,\"\")","v":1},0]
[3,null,null,null,null,null,null,"EUR",1,0]
[4,null,null,null,null,null,null,"EUR",1,0]
[5,null,null,null,null,null,null,"EUR",1,0]
[6,null,null,null,null,null,null,"EUR",1,0]
[7,null,null,null,null,null,null,"EUR",1,0]
[8,null,null,null,null,null,null,"EUR",1,0]
[9,null,null,null,null,null,null,"EUR",1,0]
[10,null,null,null,null,null,null,"EUR",1,0]
[11,null,null,null,null,null,null,"EUR",1,0]
[12,null,null,null,null,null,null,"EUR",1,0]
[13,null,null,null,null,null,null,"EUR",1,0]
[14,null,null,null,null,null,null,"EUR",1,0]
[15,null,null,null,null,null,null,"EUR",1,0]
[16,null,null,null,null,null,null,"EUR",1,0]
[17,null,null,null,null,null,null,"EUR",1,0]
{"$rows_left_out":736}
{"sheet":"rate","index":3,"n_rows":48,"n_cols":14,"rows_kept":48,"cut":false,"hidden":false,"merged":[[6,5,6,7],[6,8,6,10],[6,11,6,12],[6,1,6,4],[7,5,7,7],[4,5,4,12],[36,8,36,11],[36,0,36,3],[4,1,4,4],[5,1,5,4],[7,1,7,4],[9,1,9,12],[5,5,5,12]]}
[]
["rate",null,"OWN INITIATIVES - TEAM"]
[null,null,null,null,null,null,null,null,null,null,"€"]
[]
[null,"FLEMISH UNIVERSITY:",null,null,null,{"$f":"+'Model 1A'!F8","v":0}]
[null,"PARTNER INSTITUTION :",null,null,null,{"$f":"+'Model 1A'!F9","v":0}]
[null,"PROJECT YEAR : ",null,null,null,{"$f":"+apYear","v":0},null,null,"VLIR-UOS PROJECTCODE :",null,null,{"$f":"+'Model 1A'!J10","v":0}]
[null,"PERIOD :",null,null,null,"from :",null,null,{"$f":"'Model 1A'!G11","v":"00:00:00"},"to :",{"$f":"'Model 1A'!I11","v":"00:00:00"}]
[]
[null,"Calculation Exchange Rate (1)"]
[]
[]
["1.",null,null,null,null,null,null,null,"2."]
["exchange USD/Eur","transf. EUR to local USD-account",null,null,null,null,null,null,"exchange\nUSD/LocCur","transf. from USD-account to loc.curr.-account",null,null,null,"= name Local Currency"]
[]
["Proving documents: official statement of the bank or bank receipts",null,null,null,null,null,null,null,"Proving documents: official statement of the bank or bank receipts"]
["The average exchange rate EUR/ USD  =",null,null,{"$f":"C32/D32","v":{"$error":"#DIV/0!"}},null,null,null,null,"The average exchange rate USD/ Local Currency =",null,null,{"$f":"L32/K32","v":{"$error":"#DIV/0!"}}]
[]
[null,"Transact. Date","Amount in EUR transferred from the Belgian bank account (gross)","Amount in USD received on the local bank account (net)","exchange rate per transaction",null,null,null,null,"Transact. Date","Amount in USD transferred from the local USD bank account (gross)","Amount in Local Currency received on the local bank account (net)","exchange rate per transaction"]
["Transfer 1",null,null,null,{"$f":"IF(ISERROR(+C20/D20),\"\",+C20/D20)","v":""},null,null,null,"Transfer 1",null,null,null,{"$f":"IF(ISERROR(+L20/K20),\"\",+L20/K20)","v":""}]
["Transfer 2",null,null,null,{"$f":"IF(ISERROR(+C21/D21),\"\",+C21/D21)","v":""},null,null,null,"Transfer 2",null,null,null,{"$f":"IF(ISERROR(+L21/K21),\"\",+L21/K21)","v":""}]
["Transfer 3",null,null,null,{"$f":"IF(ISERROR(+C22/D22),\"\",+C22/D22)","v":""},null,null,null,"Transfer 3",null,null,null,""]
["Transfer 4",null,null,null,{"$f":"IF(ISERROR(+C23/D23),\"\",+C23/D23)","v":""},null,null,null,"Transfer 4",null,null,null,""]
[null,null,null,null,null,null,null,null,"Transfer 5",null,null,null,""]
[null,null,null,null,null,null,null,null,"Transfer 6",null,null,null,""]
[null,null,null,null,null,null,null,null,"Transfer 7",null,null,null,""]
[null,null,null,null,null,null,null,null,"Transfer 8",null,null,null,""]
[null,null,null,null,null,null,null,null,"Transfer 9",null,null,null,""]
[null,null,null,null,null,null,null,null,"Transfer 10",null,null,null,""]
[null,null,null,null,null,null,null,null,"Transfer 11",null,null,null,""]
[null,null,null,null,null,null,null,null,"Transfer 12",null,null,null,""]
["TOTAL:",null,{"$f":"SUM(C20:C23)","v":0},{"$f":"SUM(D20:D23)","v":0},null,null,null,null,"TOTAL:",null,{"$f":"SUM(K20:K31)","v":0},{"$f":"SUM(L20:L31)","v":0}]
[null,null,null,"Amount USD"]
[]
[]
[]
["These are the exchange rates that must be applied for all expenditures. These average exchange rates include all bank costs linked to the bank transfer and the exchange. So, these bank costs are not to be listed separately",null,null,null,null,null,null,null,"These are the exchange rates that must be applied for all expenditures. These average exchange rates include all bank costs linked to the bank transfer and the exchange. So, these bank costs are not to be listed separately"]
[]
["(1) If the transfers are made directly from EUR to local currency, these are the modifications to be done :"]
[null,"In current sheet “Rate” : undo the sheet-protection."]
{"$rows_left_out":9}
{"sheet":"Model 1D","index":4,"n_rows":775,"n_cols":13,"rows_kept":775,"cut":false,"hidden":false,"merged":[[4,0,4,2],[4,3,4,9],[5,0,5,2],[7,0,7,2],[7,8,7,9],[5,3,5,9],[6,0,6,2],[6,5,6,7],[6,8,6,9]]}
[]
["Model 1D",null,"OWN INITIATIVES - TEAM"]
[null,null,"Overview of the expenses from the local account and conversion in EURO",null,null,null,null,null,null,null,null,"€"]
[]
["FLEMISH UNIVERSITY:",null,null,{"$f":"+'Model 1A'!F8","v":0}]
["PARTNER INSTITUTION :",null,null,{"$f":"+'Model 1A'!F9","v":0}]
["PROJECT YEAR : ",null,null,{"$f":"+apYear","v":0},null,"VLIR-UOS PROJECTCODE :",null,null,{"$f":"+'Model 1A'!J10","v":0}]
["PERIOD :",null,null,"from :",null,{"$f":"+begindatum","v":"00:00:00"},"to :",{"$f":"+einddatum","v":"00:00:00"}]
[]
[]
[null,null,null,null,null,null,null,null,null,null,null,"TOTALS"]
[]
[]
[null,"A. INVESTMENT COSTS",null,null,null,null,null,null,null,null,null,{"$f":"SUMIF($B$24:$B$773,$B14,L$24:L$773)","v":0}]
[null,"B. OPERATIONAL COSTS",null,null,null,null,null,null,null,null,null,{"$f":"SUMIF($B$24:$B$773,$B15,L$24:L$773)","v":0}]
[null,"C. PERSONNEL COSTS",null,null,null,null,null,null,null,null,null,{"$f":"SUMIF($B$24:$B$773,$B16,L$24:L$773)","v":0}]
[null,"D. SCHOLARSHIPS COSTS",null,null,null,null,null,null,null,null,null,{"$f":"SUMIF($B$24:$B$773,$B17,L$24:L$773)","v":0}]
[]
[]
[null,"Errors :",null,null,null,null,null,null,null,null,null,{"$f":"ROUND(L774-SUM(L12:L19),2)","v":0},{"$f":"IF(L20=0,\"\",\"error : no category ?\")","v":""}]
[null,null,null,null,null,null,null,null,null,null,null,{"$f":"+SUM(L12:L20)","v":0}]
[{"$f":"+A2","v":"Model 1D"}]
["N°","Category","Inv. Date","classif n°","supplier","description","Amount local","Local Currency",{"$f":"+rate!I14","v":"exchange\nUSD/LocCur"},{"$f":"+rate!D33","v":"Amount USD"},{"$f":"+rate!A14","v":"exchange USD/Eur"},"Amount EUR"]
[1,null,null,null,null,null,null,{"$f":"IF(ISBLANK(G24),\"\",+CURRENCY)","v":""},{"$f":"IF(ISBLANK(G24),0,IF(H24=CURRENCY,(IF(ISERROR(rate!L$17),0,rate!L$17)),0))","v":0},{"$f":"IF(ISERROR(+G24/I24),0,+G24/I24)","v":0},{"$f":"IF(ISBLANK(G24),IF((J24=0),0,IF(ISERROR(rate!$D$17),0,rate!$D$17)),IF(ISERROR(rate!$D$17),0,rate!$D$17))","v":0},{"$f":"IF(ISERROR(+K24*J24),0,+K24*J24)","v":0}]
[2,null,null,null,null,null,null,"",{"$f":"IF(ISBLANK(G25),0,IF(H25=CURRENCY,(IF(ISERROR(rate!L$17),0,rate!L$17)),0))","v":0},0,{"$f":"IF(ISBLANK(G25),IF((J25=0),0,IF(ISERROR(rate!$D$17),0,rate!$D$17)),IF(ISERROR(rate!$D$17),0,rate!$D$17))","v":0},0]
[3,null,null,null,null,null,null,"",{"$f":"IF(ISBLANK(G26),0,IF(H26=CURRENCY,(IF(ISERROR(rate!L$17),0,rate!L$17)),0))","v":0},0,{"$f":"IF(ISBLANK(G26),IF((J26=0),0,IF(ISERROR(rate!$D$17),0,rate!$D$17)),IF(ISERROR(rate!$D$17),0,rate!$D$17))","v":0},0]
[4,null,null,null,null,null,null,"",{"$f":"IF(ISBLANK(G27),0,IF(H27=CURRENCY,(IF(ISERROR(rate!L$17),0,rate!L$17)),0))","v":0},0,{"$f":"IF(ISBLANK(G27),IF((J27=0),0,IF(ISERROR(rate!$D$17),0,rate!$D$17)),IF(ISERROR(rate!$D$17),0,rate!$D$17))","v":0},0]
[5,null,null,null,null,null,null,"",{"$f":"IF(ISBLANK(G28),0,IF(H28=CURRENCY,(IF(ISERROR(rate!L$17),0,rate!L$17)),0))","v":0},0,{"$f":"IF(ISBLANK(G28),IF((J28=0),0,IF(ISERROR(rate!$D$17),0,rate!$D$17)),IF(ISERROR(rate!$D$17),0,rate!$D$17))","v":0},0]
[6,null,null,null,null,null,null,"",{"$f":"IF(ISBLANK(G29),0,IF(H29=CURRENCY,(IF(ISERROR(rate!L$17),0,rate!L$17)),0))","v":0},0,{"$f":"IF(ISBLANK(G29),IF((J29=0),0,IF(ISERROR(rate!$D$17),0,rate!$D$17)),IF(ISERROR(rate!$D$17),0,rate!$D$17))","v":0},0]
[7,null,null,null,null,null,null,"",{"$f":"IF(ISBLANK(G30),0,IF(H30=CURRENCY,(IF(ISERROR(rate!L$17),0,rate!L$17)),0))","v":0},0,{"$f":"IF(ISBLANK(G30),IF((J30=0),0,IF(ISERROR(rate!$D$17),0,rate!$D$17)),IF(ISERROR(rate!$D$17),0,rate!$D$17))","v":0},0]
[8,null,null,null,null,null,null,"",{"$f":"IF(ISBLANK(G31),0,IF(H31=CURRENCY,(IF(ISERROR(rate!L$17),0,rate!L$17)),0))","v":0},0,{"$f":"IF(ISBLANK(G31),IF((J31=0),0,IF(ISERROR(rate!$D$17),0,rate!$D$17)),IF(ISERROR(rate!$D$17),0,rate!$D$17))","v":0},0]
[9,null,null,null,null,null,null,"",{"$f":"IF(ISBLANK(G32),0,IF(H32=CURRENCY,(IF(ISERROR(rate!L$17),0,rate!L$17)),0))","v":0},0,{"$f":"IF(ISBLANK(G32),IF((J32=0),0,IF(ISERROR(rate!$D$17),0,rate!$D$17)),IF(ISERROR(rate!$D$17),0,rate!$D$17))","v":0},0]
[10,null,null,null,null,null,null,"",{"$f":"IF(ISBLANK(G33),0,IF(H33=CURRENCY,(IF(ISERROR(rate!L$17),0,rate!L$17)),0))","v":0},0,{"$f":"IF(ISBLANK(G33),IF((J33=0),0,IF(ISERROR(rate!$D$17),0,rate!$D$17)),IF(ISERROR(rate!$D$17),0,rate!$D$17))","v":0},0]
[11,null,null,null,null,null,null,"",{"$f":"IF(ISBLANK(G34),0,IF(H34=CURRENCY,(IF(ISERROR(rate!L$17),0,rate!L$17)),0))","v":0},0,{"$f":"IF(ISBLANK(G34),IF((J34=0),0,IF(ISERROR(rate!$D$17),0,rate!$D$17)),IF(ISERROR(rate!$D$17),0,rate!$D$17))","v":0},0]
[12,null,null,null,null,null,null,"",{"$f":"IF(ISBLANK(G35),0,IF(H35=CURRENCY,(IF(ISERROR(rate!L$17),0,rate!L$17)),0))","v":0},0,{"$f":"IF(ISBLANK(G35),IF((J35=0),0,IF(ISERROR(rate!$D$17),0,rate!$D$17)),IF(ISERROR(rate!$D$17),0,rate!$D$17))","v":0},0]
[13,null,null,null,null,null,null,"",{"$f":"IF(ISBLANK(G36),0,IF(H36=CURRENCY,(IF(ISERROR(rate!L$17),0,rate!L$17)),0))","v":0},0,{"$f":"IF(ISBLANK(G36),IF((J36=0),0,IF(ISERROR(rate!$D$17),0,rate!$D$17)),IF(ISERROR(rate!$D$17),0,rate!$D$17))","v":0},0]
[14,null,null,null,null,null,null,"",{"$f":"IF(ISBLANK(G37),0,IF(H37=CURRENCY,(IF(ISERROR(rate!L$17),0,rate!L$17)),0))","v":0},0,{"$f":"IF(ISBLANK(G37),IF((J37=0),0,IF(ISERROR(rate!$D$17),0,rate!$D$17)),IF(ISERROR(rate!$D$17),0,rate!$D$17))","v":0},0]
[15,null,null,null,null,null,null,"",{"$f":"IF(ISBLANK(G38),0,IF(H38=CURRENCY,(IF(ISERROR(rate!L$17),0,rate!L$17)),0))","v":0},0,{"$f":"IF(ISBLANK(G38),IF((J38=0),0,IF(ISERROR(rate!$D$17),0,rate!$D$17)),IF(ISERROR(rate!$D$17),0,rate!$D$17))","v":0},0]
[16,null,null,null,null,null,null,"",{"$f":"IF(ISBLANK(G39),0,IF(H39=CURRENCY,(IF(ISERROR(rate!L$17),0,rate!L$17)),0))","v":0},0,{"$f":"IF(ISBLANK(G39),IF((J39=0),0,IF(ISERROR(rate!$D$17),0,rate!$D$17)),IF(ISERROR(rate!$D$17),0,rate!$D$17))","v":0},0]
[17,null,null,null,null,null,null,"",{"$f":"IF(ISBLANK(G40),0,IF(H40=CURRENCY,(IF(ISERROR(rate!L$17),0,rate!L$17)),0))","v":0},0,{"$f":"IF(ISBLANK(G40),IF((J40=0),0,IF(ISERROR(rate!$D$17),0,rate!$D$17)),IF(ISERROR(rate!$D$17),0,rate!$D$17))","v":0},0]
{"$rows_left_out":736}
{"sheet":"Model 2B","index":5,"n_rows":418,"n_cols":6,"rows_kept":418,"cut":false,"hidden":false,"merged":[[11,0,11,2],[6,0,6,1],[3,2,3,5],[4,2,4,5],[5,3,5,4],[1,1,1,4],[3,0,3,1],[4,0,4,1],[5,0,5,1]]}
["Model 2B","OWN INITIATIVES - TEAM"]
[null,"Transactions on the specific local bankaccounts (current and forward accounts) and/or cashbook"]
[]
["FLEMISH UNIVERSITY:",null,{"$f":"+'Model 1A'!F8","v":0}]
["PARTNER INSTITUTION :",null,{"$f":"+'Model 1A'!F9","v":0}]
["PROJECT YEAR : ",null,{"$f":"+apYear","v":0},"VLIR-UOS PROJECTCODE :",null,{"$f":"+'Model 1A'!J10","v":0}]
["PERIOD :",null,"from :",{"$f":"+begindatum","v":"00:00:00"},"to :",{"$f":"+einddatum","v":"00:00:00"}]
[]
[null,null,null,"CURRENCY","?"]
[null,null,{"$f":"IF(D10=\"error\",\"adapt formulas to added lines\",IF(E10=\"error\",\"adapt formulas to added lines\",\"\"))","v":""},{"$f":"IF((D12-D418)<>0,\"error\",\"\")","v":""},{"$f":"IF((E12-E418)<>0,\"error\",\"\")","v":""}]
["Nr.","Date","Description","Revenues","Expenses","Balance"]
["TOTALS",null,null,{"$f":"SUM(D13:D417)","v":0},{"$f":"SUM(E13:E417)","v":0}]
[null,null,null,null,null,{"$f":"D13-E13","v":0}]
[null,null,null,null,null,{"$f":"F13+D14-E14","v":0}]
[null,null,null,null,null,{"$f":"F14+D15-E15","v":0}]
[null,null,null,null,null,0]
[null,null,null,null,null,0]
[null,null,null,null,null,0]
[null,null,null,null,null,0]
[null,null,null,null,null,0]
[null,null,null,null,null,0]
[null,null,null,null,null,0]
[null,null,null,null,null,0]
[null,null,null,null,null,0]
[null,null,null,null,null,0]
[null,null,null,null,null,0]
[null,null,null,null,null,0]
[null,null,null,null,null,0]
[null,null,null,null,null,0]
[null,null,null,null,null,0]
[null,null,null,null,null,0]
[null,null,null,null,null,0]
[null,null,null,null,null,0]
[null,null,null,null,null,0]
[null,null,null,null,null,0]
[null,null,null,null,null,0]
[null,null,null,null,null,0]
[null,null,null,null,null,0]
[null,null,null,null,null,0]
[null,null,null,null,null,0]
{"$rows_left_out":379}
{"sheet":"Model 2B (USD)","index":6,"n_rows":418,"n_cols":6,"rows_kept":418,"cut":false,"hidden":false,"merged":[[11,0,11,2],[1,1,1,4],[3,0,3,1],[4,0,4,1],[5,0,5,1],[6,0,6,1],[3,2,3,5],[4,2,4,5],[5,3,5,4]]}
["Model 2B","OWN INITIATIVES - TEAM"]
[null,"Transactions on the specific local bankaccounts (current and forward accounts) and/or cashbook"]
[]
["FLEMISH UNIVERSITY:",null,{"$f":"+'Model 1A'!F8","v":0}]
["PARTNER INSTITUTION :",null,{"$f":"+'Model 1A'!F9","v":0}]
["PROJECT YEAR : ",null,{"$f":"+apYear","v":0},"VLIR-UOS PROJECTCODE :",null,{"$f":"+'Model 1A'!J10","v":0}]
["PERIOD :",null,"from :",{"$f":"+begindatum","v":"00:00:00"},"to :",{"$f":"+einddatum","v":"00:00:00"}]
[null,null,{"$f":"IF(D8=\"error\",\"adapt formulas to added lines\",IF(E8=\"error\",\"adapt formulas to added lines\",\"\"))","v":""},{"$f":"IF((D12-D418)<>0,\"error\",\"\")","v":""},{"$f":"IF((E12-E418)<>0,\"error\",\"\")","v":""}]
[null,null,null,"CURRENCY","USD"]
[]
["Nr.","Date","Description","Revenues","Expenses","Balance"]
["TOTALS",null,null,{"$f":"SUM(D13:D417)","v":0},{"$f":"SUM(E13:E417)","v":0}]
[null,null,null,null,null,{"$f":"D13-E13","v":0}]
[null,null,null,null,null,{"$f":"F13+D14-E14","v":0}]
[null,null,null,null,null,0]
[null,null,null,null,null,0]
[null,null,null,null,null,0]
[null,null,null,null,null,0]
[null,null,null,null,null,0]
[null,null,null,null,null,0]
[null,null,null,null,null,0]
[null,null,null,null,null,0]
[null,null,null,null,null,0]
[null,null,null,null,null,0]
[null,null,null,null,null,0]
[null,null,null,null,null,0]
[null,null,null,null,null,0]
[null,null,null,null,null,0]
[null,null,null,null,null,0]
[null,null,null,null,null,0]
[null,null,null,null,null,0]
[null,null,null,null,null,0]
[null,null,null,null,null,0]
[null,null,null,null,null,0]
[null,null,null,null,null,0]
[null,null,null,null,null,0]
[null,null,null,null,null,0]
[null,null,null,null,null,0]
[null,null,null,null,null,0]
[null,null,null,null,null,0]
{"$rows_left_out":379}
{"sheet":"hidden","index":7,"n_rows":12,"n_cols":1,"rows_kept":12,"cut":false,"hidden":false,"merged":[]}
[]
["categories (belgian account)"]
["A. INVESTMENT COSTS"]
["B. OPERATIONAL COSTS"]
["C. PERSONNEL COSTS"]
["D. SCHOLARSHIPS COSTS"]
[]
["categories (local account)"]
["A. INVESTMENT COSTS"]
["B. OPERATIONAL COSTS"]
["C. PERSONNEL COSTS"]
["D. SCHOLARSHIPS COSTS"]